architecture égyptienne
type: Concept
preferred label: ägyptische Architektur @de
preferred label: architettura egizia @it
preferred label: arquitectura egipcia @es
preferred label: Egyptian architecture @en
alternative label: ägyptische Baukunst @de
alternative label: ancient Egyptian architecture @en
alternative label: architecture de l'Egypte antique
related: pcrtJ0sJsufWPU
related: pcrtqzuLPnRwN9
related: pcrtwdvddmj0b47p4125p342
broader: architecture
in scheme: TH 1
member of: pcrtnbDLi2FkAj
member of: pcrtxw5st07tnr
subordinate array: https://pactols.frantiq.fr/opentheso/
created: 2018-12-04 17:33:29.991998
modified: 2023-08-02 00:00:00.0
creator: magali.lugnot
contributor: blandine.nouvel
definition: Pratiques architecturales qui avaient cours pendant plus de trois millénaires pendant la période antique en Egypte. (WP le 04/12/18)

arc (architecture)
type: Concept
preferred label: arch @en
preferred label: arco (architettura) @it
preferred label: arco (arquitectura) @es
preferred label: Bogen (Architektur) @de
alternative label: arche
related: pcrttcSF6qn4l3
related: pcrt76mn7782b7tmnvhd2mmn
related: pcrtwbjm6gdbtwqbgrrds6bz
broader: élément architectural
in scheme: TH 1
member of: pcrttp2qp0084z
member of: pcrtnbDLi2FkAj
member of: pcrtv0jq332vcq3gxt5m13d5
created: 2020-09-30 11:06:30.722033
modified: 2024-03-19 00:00:00.0
creator: blandine.nouvel
contributor: irene.weis
definition: Élément d'ossature de directrice courbe ou polygonale, qui enjambe l'espace ouvert entre deux piliers (pieds-droits, etc.) ou murs en transmettant toute la charge qu'il supporte aux appuis (culées, contreforts, etc.), moyennant une force oblique dénommée « poussée » (Wikipedia, 30/9/2020).

archives de fouille
type: Concept
preferred label: archaeological archives @en
preferred label: archivio archeologico @it
preferred label: archivos arqueológicos @es
preferred label: Grabungsarchive @de
alternative label: archaeological excavation archives @en
alternative label: archives archéologiques
alternative label: archivos de excavación @es
alternative label: documentation archéologique
alternative label: documentation de fouilles
related: pcrtVLJq3mXSe8
related: pcrt6SHaYYhLXf
related: pcrtdhYoIspgZB
related: pcrtQfOKoqdRIG
related: pcrtm5RlIQDSYs
related: pcrt3z6t6961rc
related: pcrtwn3c74x1hnhvsgt8b0k3
broader: archieven
in scheme: TH 1
member of: pcrtj1zjzzpbmd
member of: pcrtnbDLi2FkAj
created: 2018-06-27 10:58:59.395382
modified: 2025-06-10 00:00:00.0
creator: patricia.moitrel
contributor: lubin.grivault
definition: A set of documents on paper or digital files, including textual data, images, 2D or 3D dimensioned points, spatially referenced data, audio and video recordings, etc. collected or produced during an archaeological operation. @en
history note: 2025-06-10 : Modification et traduction de la définition.
definition: Ensemble de documents sur support papier ou de fichiers numériques, comprenant des données textuelles, des images, des points cotés en 2D ou 3D, des données à référence spatiale, des enregistrements audio et vidéo, etc. collectés ou produits lors d'une opération archéologique.
replaces: pcrtb0t2vdd0pj

arquebuse
type: Concept
preferred label: arcabuz @es
preferred label: archibugio @it
preferred label: Arkebuse @de
preferred label: arquebus @en
broader: pcrtaXr3XklEjk
in scheme: TH 1
member of: pcrttp2qp0084z
member of: pcrtnbDLi2FkAj
broad match: T69-9121
created: 2020-08-04 13:31:48.177403
modified: 2023-08-02 00:00:00.0
creator: marie.lakermance
contributor: blandine.nouvel
definition: Arme à feu de portée effective limitée (moins de 50 mètres), assez lourde et encombrante mais dont on pouvait épauler les dernières versions. (WP)

Archidamos III de Sparte
type: Concept
preferred label: Archidamo III @it
preferred label: Archidamus 3 @nl
preferred label: Archidamus III @en
preferred label: Arquidamo III @es
preferred label: أرخيداموس الثالث @ar
alternative label: Archidamos 3
alternative label: King Archidamus III of Sparta @en
broader: pcrtrRpZq0yAxl
in scheme: TH 1
member of: pcrt55mxscwskk
member of: pcrtrG9ejXOVNA
member of: pcrt7sd8c6005bgc5s69qrbt
subordinate array: https://pactols.frantiq.fr/opentheso/
created: 2012-11-05 00:00:00.0
modified: 2024-03-15 00:00:00.0
contributor: blandine.nouvel
definition: Roi de Sparte 360 à 338 av. J.-C. Son fils Agis III lui succède.

archieven
type: Concept
preferred label: Archiv @de
preferred label: archives
preferred label: archivio @it
preferred label: archivos @es
preferred label: سجلات @ar
alternative label: archives administratives
related: pcrtEIoHXm4ThB
related: pcrtvskf7FZVME
related: archiviste
narrower: archives privées
narrower: crt4iRs69TGJU
narrower: archives de fouille
narrower: pcrtcjzbxvbnmn
broader: pcrtwjm56p81mg
in scheme: TH 1
member of: pcrtj1zjzzpbmd
member of: pcrtnbDLi2FkAj
created: 2007-02-08 00:00:00.0
modified: 2025-06-10 00:00:00.0
contributor: lubin.grivault
definition: A collection of documents not in common use, collected, catalogued and preserved to serve as a record of the history of a community or an individual. @en
history note: 2025-06-10 : Ajout d'une ressource externe et traduction de la définition.
definition: Ensemble de documents hors d'usage courant, rassemblés, répertoriés et conservés pour servir à l'histoire d'une collectivité ou d'un individu.

Archiloque
type: Concept
preferred label: Archilochos
preferred label: Archilochus @en
preferred label: Archiloco @it
preferred label: Arquíloco @es
preferred label: أرخيلوخوس @ar
related: pcrtkg8kae6Jtm
related: pcrthaeJNwN3zK
broader: pcrtEWSun8TpKg
in scheme: TH 1
member of: pcrt55mxscwskk
member of: pcrtrG9ejXOVNA
member of: pcrt7sd8c6005bgc5s69qrbt
subordinate array: https://pactols.frantiq.fr/opentheso/
created: 2007-02-08 00:00:00.0
modified: 2024-03-15 00:00:00.0
contributor: blandine.nouvel
definition: Poète élégiaque, v.712-v.645 av. J.-C. Originaire de Paros.

Archimède
type: Concept
preferred label: Archimede @it
preferred label: Archimedes @de
preferred label: Archimedes of Syracuse @en
preferred label: Arquímedes @es
preferred label: Αρχιμήδης @el
preferred label: أرخميدس @ar
related: pcrtpu8RHYypSt
related: pcrtO15bLmTWSv
related: crt27frSZhScu
related: pcrttpz64pIxYV
broader: pcrtEWSun8TpKg
in scheme: TH 1
member of: pcrt55mxscwskk
member of: pcrtrG9ejXOVNA
member of: pcrt7sd8c6005bgc5s69qrbt
subordinate array: https://pactols.frantiq.fr/opentheso/
created: 2007-02-08 00:00:00.0
modified: 2024-03-15 00:00:00.0
contributor: blandine.nouvel
definition: Astronome, physicien, mathématicien et ingénieur, 287-212 av. J.-C. Originaire de Syracuse.

Archytas de Tarente
type: Concept
preferred label: Archita @it
preferred label: Archtyas van Tarentum @nl
preferred label: Archytas
preferred label: Arquitas de Tarento @es
preferred label: أرخيتاس من تارنتو @ar
alternative label: Archita di Taranto @it
alternative label: Archytas of Tarentum @en
related: pcrtpu8RHYypSt
related: pcrt0Zjgfx6Zlb
related: pcrtKssRLH8WdZ
related: pcrtO15bLmTWSv
broader: pcrtEWSun8TpKg
in scheme: TH 1
member of: pcrt55mxscwskk
member of: pcrtrG9ejXOVNA
member of: pcrt7sd8c6005bgc5s69qrbt
subordinate array: https://pactols.frantiq.fr/opentheso/
created: 2012-11-05 00:00:00.0
modified: 2025-05-22 00:00:00.0
contributor: blandine.nouvel
definition: Philosophe pythagoricien, mathématicien, astronome et homme politique grec, 435-347 av. J.-C.

architecte
type: Concept
preferred label: architect @en
preferred label: Architekt @de
preferred label: architetto @it
preferred label: arquitecto @es
preferred label: مُهندس بَناء @ar
hidden label: architectes
related: architecture
related: pcrtHUK7VRZS2q
related: pcrtZ1IozZ3QGa
related: pcrt94nNkbu0Aq
related: pcrtPgMbbOpEJh
related: pcrtTN8Lt4H8HV
related: pcrtf2tmc1lah2
related: pcrtv14f965kw7v74vmcwtr3
related: pcrth4bvgtj30229s3nxktv0
related: pcrtt6nwzwnqhsghzm6nww3r
related: pcrtch4kkqg6r3tkj0bn4sdf
related: pcrt72066hn1vdgsnstc68zf
related: pcrtq6f026v74kmns5119wpp
related: pcrt6bcr9f349bm952h1z8bb
related: pcrtpvvk0chngj9fdfmq96dg
related: pcrtlhbJ1N00Wc
narrower: architecte naval
broader: pcrtIWZ9OUGKZV
in scheme: TH 1
member of: pcrtxnpdz6h34n
member of: pcrtnbDLi2FkAj
subordinate array: https://pactols.frantiq.fr/opentheso/
created: 2007-02-08 00:00:00.0
modified: 2025-04-18 00:00:00.0
contributor: justine.vincent
definition: A building professional whose job is to take part in everything to do with building and space planning; generally speaking, he acts as project manager. @en
history note: 2025-04-18 : ajout de la définition.
definition: Professionnel du bâtiment dont la fonction est de participer à tout ce qui concerne l'acte de bâtir et l'aménagement de l'espace ; d'une manière générale, il exerce la fonction de maître d'œuvre.
replaces: pcrttSahDpLsSE
replaces: pcrtl9zRnyr7Fq
replaces: pcrthXXh88hk3L
replaces: pcrtHT5VRA7PzY

architecte naval
type: Concept
preferred label: architetto navale @it
preferred label: arquitecto naval @es
preferred label: naval architect @en
preferred label: Schiffsbauer @de
preferred label: مهندس بناء سُفُن @ar
alternative label: ship architect @en
related: pcrtxMLnhaMAsQ
related: crtNfM6deqSZG
broader: architecte
in scheme: TH 1
member of: pcrtxnpdz6h34n
member of: pcrtnbDLi2FkAj
created: 2013-11-12 00:00:00.0
modified: 2025-04-18 00:00:00.0
contributor: justine.vincent
note: Person who designs ships, boats or other floating structures. @en
note: Personne qui conçoit des navires, bateaux, ou d'autres structures flottantes.
history note: 2025-18-04 : ajout de la définition.

architectonique
type: Concept
preferred label: architectonics @en
preferred label: Architekturlehre @de
preferred label: arquitectónico @es
preferred label: bouwkunde @nl
preferred label: regola architettonica @it
preferred label: فن العمارة @ar
alternative label: norma arquitectónica @es
related: architecture
broader: pcrtIvSnh3tF91
in scheme: TH 1
member of: pcrtj1zjzzpbmd
member of: pcrtnbDLi2FkAj
subordinate array: https://pactols.frantiq.fr/opentheso/
created: 2007-02-08 00:00:00.0
modified: 2023-08-02 00:00:00.0
contributor: blandine.nouvel
definition: Ensemble des règles de l'architecture (Lar.)

élément architectural
type: Concept
preferred label: architecturaal element @nl
preferred label: architectural element @en
preferred label: Architekturelemente @de
preferred label: elemento architettonico @it
preferred label: elemento arquitectónico @es
preferred label: عناصر هندسية @ar
alternative label: decorazione architettonica @it
alternative label: élément architectonique
related: architecture
related: pcrtiNStQWVtFe
related: ornement architectural
narrower: pcrtbHXbvTPtDj
narrower: pcrtfZeS5mp6jT
narrower: pcrtbhNbSIzWXG
narrower: pcrtKoEikI0iIm
narrower: croix (architecture)
narrower: pcrtQ4RKLBtJUU
narrower: pcrtyiFNGlqojs
narrower: pcrtYdQHLnbLJQ
narrower: pcrtD2xY03ujqV
narrower: pcrtQ8KBgBVXuB
narrower: pcrtPFlqRPxAw0
narrower: pcrt7HbtemJhVu
narrower: pcrtKRoPbSDJ9I
narrower: socle-piédestal
narrower: pcrtNSNYxrQDas
narrower: pcrtuPXSV3Ry2o
narrower: pcrt4TocBDGFe8
narrower: arc (architecture)
narrower: pcrt9dfztzdj8vtgk43x9dk5
narrower: pcrtf6p0kt97m1j0bn7qpkn8
narrower: pcrt3zqvk8qww52gp52dxk36
narrower: pcrt01hchqx21hqg9sr1xt5j
narrower: pcrttvw4b292h164vqswwxxv
narrower: pcrt4gp8j0rk7d9m67mswf8t
broader: pcrt4kW0qGXJud
in scheme: TH 1
member of: pcrttp2qp0084z
member of: pcrtnbDLi2FkAj
subordinate array: https://pactols.frantiq.fr/opentheso/
created: 2007-02-08 00:00:00.0
modified: 2023-08-02 00:00:00.0
contributor: blandine.nouvel
definition: L'élément architectural est une des parties fonctionnelles, structurelles ou décoratives d'une œuvre architecturale. (WP le 08.04.20 - traduit de l'espagnol)
history note: Les deux concepts distincts "élément architectural" et "ornement architectural" sont scindés le 08.04.20. Avant cette date, les notices concernées sont toutes indexées avec le concept 17661 "élément architectural"
editorial note: Le 08.04.20, le concept 17661 qui recouvrent plusieurs concepts : preflabel "sculpture architecturale" altlabel "décor architectural", "décoration architectonique", "élément architectonique", "élément architectural", "ornement architectural", "sculpture architectonique" et "sculpture ornementale" est renommé "élément architectural". "Ornement architectural" est créé par ailleurs avec l'identifiant 253859 et les synonymes "décor architectural", "décoration architectonique", "sculpture architecturale" et "sculpture architectonique"

croix (architecture)
type: Concept
preferred label: architectural cross @en
preferred label: Architekturkreuz @de
preferred label: croce architettonica @it
preferred label: cruz @es
alternative label: croix architecturale
alternative label: croix funéraire
alternative label: croix tombale
related: pcrtxS1kGjQJiw
related: pcrtmdJdxASSdo
related: pcrtZNKSEYhsuk
related: pcrt65pk05n2d4xdg528nvqj
broader: élément architectural
in scheme: TH 1
member of: pcrttp2qp0084z
member of: pcrtnbDLi2FkAj
member of: pcrtv0jq332vcq3gxt5m13d5
narrow match: T69-380
narrow match: T505-1064
created: 2007-02-08 00:00:00.0
modified: 2025-05-27 00:00:00.0
contributor: blandine.nouvel
definition: En architecture, élément en forme de croix, constitué d'un montant ou hampe et d'une traverse ou croisillon, dont l'intersection donne quatre branches (Vogüé et al.: Glossaire de termes techniques à l'usage des lecteurs de la Nuit des Temps, 3e éd. revue et corrigée, Zodiaque, 1983, p.157).

dessin d'architecture
type: Concept
preferred label: architectural drawing @en
preferred label: dibujo arquitectónico @es
preferred label: disegno architettonico @it
preferred label: Zeichnung (Architektur) @de
preferred label: رسم معماري @ar
related: représentation architecturale
related: restitution architecturale
broader: pcrtzmgVgArOJh
in scheme: TH 1
member of: pcrtj1zjzzpbmd
member of: pcrtnbDLi2FkAj
created: 2013-10-30 00:00:00.0
modified: 2025-06-05 00:00:00.0
contributor: lubin.grivault
definition: Technical representation of existing or planned buildings to help understand their characteristics. @en
history note: 2025-06-05 : Modification et traduction de la définition.
definition: Représentation technique d'édifices, construits ou en projet, permettant une compréhension de leurs caractéristiques.

terre cuite architecturale
type: Concept
preferred label: architecturale terracotta @nl
preferred label: Architekturelemente aus Terrakotta @de
preferred label: ceramic building material @en
preferred label: material cerámico constructivo @es
preferred label: terracotta architettonica @it
preferred label: طين مشوي @ar
alternative label: CBM @en
alternative label: céramique architecturale
related: pcrtW9mUFwQABF
related: pcrtKoEikI0iIm
related: crtfEfQa67rEb
related: pcrt0794kdhdp5
related: atelier de terre cuite architecturale
narrower: pcrt019SSqbR7W
narrower: pcrttqRMDTN4VE
narrower: pcrt7xtkh89ndh
broader: crt9ey83pmtqt
in scheme: TH 1
member of: pcrttp2qp0084z
member of: pcrtnbDLi2FkAj
created: 2012-03-26 00:00:00.0
modified: 2023-11-10 00:00:00.0
contributor: justine.vincent
definition: Matériau de construction en terre cuite utilisés dans l'architecture ancienne.

représentation architecturale
type: Concept
preferred label: architecturale voorstelling @nl
preferred label: architectural representation @en
preferred label: architektonische Darstellung @de
preferred label: raffigurazione architettonica @it
preferred label: representación arquitectónica @es
preferred label: تمثيل معماري @ar
alternative label: architectural depiction @en
alternative label: monument figuré
related: restitution architecturale
related: dessin d'architecture
narrower: pcrtdgqbhds61brzm318b6ds
broader: pcrthzd38p8q3f
in scheme: TH 1
member of: pcrtj1zjzzpbmd
member of: pcrtnbDLi2FkAj
created: 2007-02-08 00:00:00.0
modified: 2023-08-02 00:00:00.0
contributor: blandine.nouvel
scope note: A utiliser pour des représentations autres que le dessin, par exemple : des tableaux, sur des monnaies, des gravures etc. Pour les représentations à vocation scientifique, privilégier "restitution archiecturale". Pour les dessins à strictement parler, privilégier "dessin d'architecture".

inscription architecturale
type: Concept
preferred label: architectural inscription @en
preferred label: Bauinschrift @de
preferred label: inscripción arquitectónica @es
preferred label: iscrizione architettonica @it
related: architecture
broader: pcrtOhSuDJJeQX
in scheme: TH 1
member of: pcrttp2qp0084z
member of: pcrtnbDLi2FkAj
member of: pcrtv0jq332vcq3gxt5m13d5
subordinate array: https://pactols.frantiq.fr/opentheso/
created: 2019-09-19 16:40:16.538916
modified: 2025-04-25 00:00:00.0
creator: magali.lugnot
contributor: lubin.grivault
definition: Inscribed text written or engraved on an architectural element. @en
history note: 2025-04-25 : Modification et traduction de la définition.
definition: Texte inscrit qui est rédigé ou gravé sur un élément architectural.

maquette architecturale
type: Concept
preferred label: architectural model @en
preferred label: Architekturmodell @de
preferred label: modello architettonico @it
preferred label: modelo arquitectónico @es
related: architecture
related: pcrt31q4046f877cz39sz0k4
broader: pcrt4iNidJ2qfx
in scheme: TH 1
member of: pcrttp2qp0084z
member of: pcrtnbDLi2FkAj
created: 2019-09-19 17:01:16.735509
modified: 2025-04-16 00:00:00.0
creator: magali.lugnot
contributor: lubin.grivault
history note: 2025-04-16 : Ajout et traduction de la définition.
definition: Reconstitution en volumes de projets architecturaux, généralement mais pas nécessairement à l'échelle, pouvant comprendre une représentation du site ou du contexte environnant.
definition: Volume reconstructions of architectural projects, generally but not necessarily to scale, which may include a representation of the site or surrounding context. @en

ordre architectural
type: Concept
preferred label: architectural order @en
preferred label: orden arquitectónico @es
preferred label: ordine architettonico @it
preferred label: Säulenordnung @de
alternative label: architectural classification @en
alternative label: classical order @en
hidden label: ordres
related: architecture
narrower: pcrtvcdWHdToS1
narrower: pcrt1ScsoRMkDF
narrower: pcrtZc4FZ8kHIq
narrower: pcrt3njvXKnAX2
narrower: pcrtg6jJ6xN6Hr
narrower: pcrtV1LWM7OVzv
broader: pcrtIvSnh3tF91
in scheme: TH 1
member of: pcrtj1zjzzpbmd
member of: pcrtnbDLi2FkAj
subordinate array: https://pactols.frantiq.fr/opentheso/
created: 2019-09-19 16:32:01.665963
modified: 2025-11-25 15:00:34.772
creator: magali.lugnot
contributor: justine.vincent
definition: Système cohérent de proportions modulaires et de formes appliquées aux élévations.

ornement architectural
type: Concept
preferred label: architectural ornament @en
preferred label: Bauplastik @de
preferred label: decoración arquitectónica @es
preferred label: ornamento architettonico @it
preferred label: نحت معماري @ar
alternative label: décor architectural
alternative label: décoration architectonique
alternative label: décoration architecturale
alternative label: escultura arquitectónica @es
alternative label: ornementation architecturale
alternative label: sculpture architectonique
alternative label: sculpture architecturale
alternative label: sculpture ornementale
alternative label: scultura architettonica @it
related: pcrt4rR2kyMQuW
related: élément architectural
related: pcrtGpD9MBAlEU
related: pcrt75xcvc6s01p9hxwjqh7b
narrower: pcrtTQjJbnRU7S
narrower: pcrtMFl7nP8iNo
narrower: pcrtcKecfL7Beu
narrower: pcrtvS2lfiKO1a
narrower: pcrtwSKY8fR3qs
narrower: pcrt98n6h95hof
narrower: pcrtNQL40Ax17n
narrower: pcrteKsMTzwAWw
narrower: pcrt7q7SOMjW4B
narrower: pcrtj08jbnbks0zn29zk0053
broader: pcrtmiBDKimOV6
in scheme: TH 1
member of: pcrttp2qp0084z
member of: pcrtnbDLi2FkAj
created: 2020-04-08 15:06:02.901223
modified: 2025-04-28 00:00:00.0
creator: magali.lugnot
contributor: lubin.grivault
definition: Élément de décor sculpté, simple ou complexe, singulier car toujours présenté sans répétition.
definition: An element of sculpted decoration, simple or complex, which is unique because it is always presented without repetition. @en
history note: 2020-04-08 : Création du concept. Avant cette date, les notices concernées étaient indexées avec le concept 17661 "élément architectural". 2025-04-28 : Modification et traduction de la définition.
replaces: pcrt0ssc5k4rn8pvpwhhv2xv

programme architectural
type: Concept
preferred label: architectural programme @en
preferred label: architektonisches Programm @de
preferred label: programa arquitectónico @es
preferred label: programma architettonico @it
alternative label: architectural program @en
alternative label: building project @en
related: architecture
related: pcrtJVKn9XsZH9
broader: pcrt2p91fkq17b
in scheme: TH 1
member of: pcrtj1zjzzpbmd
member of: pcrtnbDLi2FkAj
created: 2019-09-30 15:19:15.734594
modified: 2023-08-02 00:00:00.0
creator: magali.lugnot
contributor: blandine.nouvel
definition: Projet concernant un ensemble de constructions associées par leur destination ou par leur composition dans un même lieu.

restitution architecturale
type: Concept
preferred label: architectural restoration @en
preferred label: Baurekonstruktion @de
preferred label: restitución arquitectónica @es
preferred label: restituzione architettonica @it
related: représentation architecturale
related: dessin d'architecture
broader: pcrtMSRKVDdz7Z
in scheme: TH 1
member of: pcrtj1zjzzpbmd
member of: pcrtnbDLi2FkAj
created: 2018-11-09 12:25:56.340735
modified: 2023-08-02 00:00:00.0
creator: magali.lugnot
contributor: blandine.nouvel
scope note: Ne concerne que les dessins d'architecture réalisés en vue d'une étude archéologique. Ne concerne pas les projets de création architecturale ni artistiques.

remaniement architectural
type: Concept
preferred label: architectural reworking @en
preferred label: architektonische Umgestaltung @de
preferred label: rediseño arquitectónico @es
preferred label: riprogettazione architettonica @it
alternative label: architectural modification @en
alternative label: architectural redesign @en
alternative label: changement architectural
alternative label: modification architecturale
related: architecture
broader: technique de construction
in scheme: TH 1
member of: pcrtj1zjzzpbmd
member of: pcrtnbDLi2FkAj
created: 2019-09-30 15:29:51.481141
modified: 2023-08-02 00:00:00.0
creator: magali.lugnot
contributor: blandine.nouvel
definition: Réorganisation de l'élévation et/ou du plan d'un bâtiment.
replaces: pcrtEUYPUWb3Yu

sources architecturales
type: Concept
preferred label: architectural sources @en
preferred label: fonti architettoniche @it
preferred label: fuentes arquitectónicas @es
preferred label: Quellen zu Architektur und Bauwesen @de
related: architecture
broader: pcrtEIoHXm4ThB
in scheme: TH 1
member of: pcrtj1zjzzpbmd
member of: pcrtnbDLi2FkAj
created: 2018-07-05 10:19:39.095283
modified: 2023-08-02 00:00:00.0
creator: magali.lugnot
contributor: blandine.nouvel

atelier de terre cuite architecturale
type: Concept
preferred label: architectural terracotta workshop @en
preferred label: laboratorio sugli elementi architettonici in terracotta @it
alternative label: atelier de TCA
alternative label: fabrique de terre cuite architecturale
related: terre cuite architecturale
broader: pcrtfUZSMbifle
in scheme: TH 1
member of: pcrttp2qp0084z
member of: pcrtnbDLi2FkAj
member of: pcrtv0jq332vcq3gxt5m13d5
created: 2024-06-03 00:00:00.0
modified: 2025-04-29 00:00:00.0
creator: patricia.moitrel
contributor: blandine.nouvel
definition: Place where clay pastes intended for architectural ornamentation are processed and worked (Patriarche). @en
definition: Lieu où s'effectuent de manière préférentielle le traitement et le travail des pâtes argileuses destinées à l'ornementation architecturale (Patriarche).

architecture
type: Concept
preferred label: architectuur @nl
preferred label: Architektur @de
preferred label: architettura @it
preferred label: arquitectura @es
preferred label: عمارة @ar
related: architecte
related: architectonique
related: pcrtP6goqQWM9k
related: pcrtjbX1Zygs38
related: pcrthT7f96LxBR
related: élément architectural
related: sources architecturales
related: ordre architectural
related: inscription architecturale
related: maquette architecturale
related: programme architectural
related: remaniement architectural
related: pcrt7gcjq98674fn4nj1wn83
related: pcrtqp17bqbngkd13cvp5mqd
related: pcrt31q4046f877cz39sz0k4
narrower: architecture chrétienne
narrower: architecture domestique
narrower: architecture funéraire
narrower: architecture grecque
narrower: architecture ibérique
narrower: architecture militaire
narrower: architecture minoenne
narrower: architecture monumentale
narrower: architecture islamique
narrower: architecture publique
narrower: architecture punique
narrower: architecture religieuse
narrower: architecture romaine
narrower: architecture wisigothique
narrower: architecture navale
narrower: pcrt3S7lIydczN
narrower: architecture rurale
narrower: architecture mycénienne
narrower: architecture égyptienne
narrower: architecture étrusque
narrower: architecture mésopotamienne
narrower: architecture urbaine
narrower: architecture castrale
narrower: architecture nabatéenne
narrower: architecture vernaculaire
narrower: architecture coloniale
broader: pcrtvuB4pIF1tO
in scheme: TH 1
member of: pcrtnbDLi2FkAj
member of: pcrtxw5st07tnr
created: 2007-02-08 00:00:00.0
modified: 2023-08-02 00:00:00.0
contributor: blandine.nouvel
definition: Art de construire les bâtiments (Lar.)
replaces: architecture (conception)

architecture byzantine
type: Concept
preferred label: architettura bizantina @it
preferred label: arquitectura bizantina @es
preferred label: Byzantijnse architectuur @nl
preferred label: Byzantine architecture @en
preferred label: byzantinische Baukunst @de
preferred label: عمارة بيزنطية @ar
alternative label: byzantinische Architektur @de
broader: architecture chrétienne
in scheme: TH 1
member of: pcrtnbDLi2FkAj
member of: pcrtxw5st07tnr
created: 2007-02-08 00:00:00.0
modified: 2023-08-02 00:00:00.0
contributor: blandine.nouvel
definition: A pour berceau l'Empire byzantin et il est d'usage de réserver ce terme aux monuments élevés à partir du règne de Justinien. L'architecture byzantine est caractérisée par les coupoles sur pendentifs en brique. Les extérieurs sont enduits sobrement, alors que les intérieurs sont décorés de mosaïques aux couleurs vives et de lambris de panneaux de marqueterie de marbre. (Wikipédia)

architecture castrale
type: Concept
preferred label: architettura castrale @it
preferred label: arquitectura del castillo @es
preferred label: Burgenbau @de
preferred label: castle architecture @en
related: pcrtRFSvuXH6BD
broader: architecture
in scheme: TH 1
member of: pcrtnbDLi2FkAj
member of: pcrtxw5st07tnr
subordinate array: https://pactols.frantiq.fr/opentheso/
created: 2019-09-30 15:51:46.405531
modified: 2023-08-02 00:00:00.0
creator: magali.lugnot
contributor: blandine.nouvel
definition: Soit l'architecture des châteaux. Elle correspond chronologiquement au castellum dans l'Antiquité tardive ; au castrum de l'armée romaine, repris par les premiers royaumes du Haut Moyen Âge ; à la motte castrale (restes surélevés d'une ancienne place forte) ; au château fort du Moyen Âge à compter du IXe siècle. (d'ap. Wikipedia)

architecture chrétienne
type: Concept
preferred label: architettura cristiana @it
preferred label: arquitectura cristiana @es
preferred label: christelijke architectuur @nl
preferred label: Christian architecture @en
preferred label: christliche Architektur @de
preferred label: عمارة مسيحية @ar
related: architecture religieuse
narrower: architecture byzantine
narrower: architecture gothique
narrower: architecture paléochrétienne
narrower: architecture romane
broader: architecture
in scheme: TH 1
member of: pcrtnbDLi2FkAj
member of: pcrtxw5st07tnr
subordinate array: https://pactols.frantiq.fr/opentheso/
created: 2007-02-08 00:00:00.0
modified: 2023-08-02 00:00:00.0
contributor: blandine.nouvel
definition: Architecture des lieux de culte dans la religion chrétienne. (WP)

architecture coloniale
type: Concept
preferred label: architettura coloniale @it
preferred label: arquitectura colonial @es
preferred label: colonial architecture @en
preferred label: koloniale architectuur @nl
preferred label: Kolonialstil @de
related: pcrtqVg5EE8ryz
related: pcrtxAZPiD2QHa
related: pcrtc0mj1p74qj25c1mwg35r
broader: architecture
in scheme: TH 1
member of: pcrtv0jq332vcq3gxt5m13d5
member of: pcrtxw5st07tnr
created: 2024-09-20 00:00:00.0
modified: 2024-10-08 00:00:00.0
creator: patricia.moitrel
contributor: blandine.nouvel
definition: Ensemble des styles architecturaux développés dans l'ensemble des colonies d'empires européens et de leurs possessions d'outre-mer, à partir de l'époque moderne, d'après le modèle du pays colonialiste d'origine.
definition: A group of architectural styles developed in all the colonies of European empires and their overseas possessions, from the modern era onwards, based on the model of the colonialist country of origin. @en

architecture domestique
type: Concept
preferred label: architettura domestica @it
preferred label: arquitectura doméstica @es
preferred label: domestic architecture @en
preferred label: Hausarchitektur @de
preferred label: huisarchitectuur @nl
preferred label: عمارة مساكن @ar
related: pcrtbptj4SOA1W
related: architecture vernaculaire
broader: architecture
in scheme: TH 1
member of: pcrtnbDLi2FkAj
member of: pcrtxw5st07tnr
subordinate array: https://pactols.frantiq.fr/opentheso/
created: 2007-02-08 00:00:00.0
modified: 2023-08-02 00:00:00.0
contributor: blandine.nouvel
definition: Architecture de bâtiment à usage individuel ou familial.

architecture étrusque
type: Concept
preferred label: architettura etrusca @it
preferred label: arquitectura etrusca @es
preferred label: Etruscan architecture @en
preferred label: etruskische Architektur @de
alternative label: etruskische Baukunst @de
related: pcrt5eUmg9dK5H
broader: architecture
in scheme: TH 1
member of: pcrtnbDLi2FkAj
member of: pcrtxw5st07tnr
subordinate array: https://pactols.frantiq.fr/opentheso/
created: 2018-12-04 17:37:31.104159
modified: 2023-08-02 00:00:00.0
creator: magali.lugnot
contributor: blandine.nouvel
definition: L'architecture étrusque, comme beaucoup d'autres de ses pratiques culturelles, se caractérise par l'intégration de savoirs précédents, issus des cultures grecque ou plus orientales, puis de leur assimilation en y apportant des modifications, et ensuite de leur transmission et intégration au monde romain. (WP le 04/12/18)

architecture funéraire
type: Concept
preferred label: architettura funeraria @it
preferred label: arquitectura funeraria @es
preferred label: funeraire architectuur @nl
preferred label: funerary architecture @en
preferred label: Grabarchitektur @de
preferred label: عمارة جنائزية @ar
related: pcrtbza1yQv2Rr
broader: architecture
in scheme: TH 1
member of: pcrtnbDLi2FkAj
member of: pcrtxw5st07tnr
subordinate array: https://pactols.frantiq.fr/opentheso/
created: 2007-02-08 00:00:00.0
modified: 2024-10-16 00:00:00.0
contributor: patricia.moitrel
history note: 2024-10-16 : suppression de la note éditoriale (code patriarche).
definition: Art, science et technique de la construction, de l'aménagement des édifices relatifs à la mort.

architecture gothique
type: Concept
preferred label: architettura gotica @it
preferred label: arquitectura gótica @es
preferred label: Gothic architecture @en
preferred label: Gotik @de
preferred label: gotische architectuur @nl
preferred label: عمارة قوطية @ar
alternative label: gotische Architektur @de
related: pcrtb1k3gjmd5z8bpqd98tt9
broader: architecture chrétienne
in scheme: TH 1
member of: pcrtnbDLi2FkAj
member of: pcrtxw5st07tnr
created: 2007-02-08 00:00:00.0
modified: 2023-08-02 00:00:00.0
contributor: blandine.nouvel
definition: Style architectural d'origine française qui s'est développé à partir de la seconde partie du Moyen Âge en Europe occidentale. Elle apparaît en Île-de-France et en Haute-Picardie au XIIe siècle. Elle se diffuse rapidement au nord puis au sud de la Loire et en Europe jusqu'au milieu du XVIe siècle et même jusqu'au XVIIe siècle dans certains pays. L'esthétique gothique et ses techniques se perpétuent dans l'architecture française au-delà du XVIe siècle, en pleine période classique, dans certains détails et modes de constructions. Enfin, un véritable renouveau apparaît avec la vague de l'historicisme du XIXe siècle jusqu'au début du XXe siècle. Le style a alors été qualifié de néo-gothique. (WP)

architecture grecque
type: Concept
preferred label: architettura greca @it
preferred label: arquitectura griega @es
preferred label: Greek architecture @en
preferred label: griechische Architektur @de
preferred label: Griekse architectuur @nl
preferred label: عمارة يونانية @ar
alternative label: girechische Baukunst @de
related: pcrtvcdWHdToS1
related: pcrtZc4FZ8kHIq
related: pcrt3njvXKnAX2
related: pcrtg6jJ6xN6Hr
related: pcrtgG4Dj9tJNk
broader: architecture
in scheme: TH 1
member of: pcrtnbDLi2FkAj
member of: pcrtxw5st07tnr
subordinate array: https://pactols.frantiq.fr/opentheso/
created: 2007-02-08 00:00:00.0
modified: 2023-08-02 00:00:00.0
contributor: blandine.nouvel
definition: Architecture qui prospéra en Grèce à la fin de la période mycénienne (du XIIème) jusqu'au VIIème siècle avant J.-C.

architecture ibérique
type: Concept
preferred label: architettura iberica @it
preferred label: arquitectura ibérica @es
preferred label: Iberian architecture @en
preferred label: Iberische architectuur @nl
preferred label: iberische Architektur @de
preferred label: عمارة إيبيرية @ar
alternative label: iberische Baukunst @de
broader: architecture
in scheme: TH 1
member of: pcrtnbDLi2FkAj
member of: pcrtxw5st07tnr
subordinate array: https://pactols.frantiq.fr/opentheso/
created: 2007-02-08 00:00:00.0
modified: 2023-08-02 00:00:00.0
contributor: blandine.nouvel
definition: Architecture de la péninsule à la pointe du Sud-Est de l’Europe, comprenant à l’heure actuelle Andorre, Espagne, Portugal, Gibraltar et sud-ouest de la France.

architecture islamique
type: Concept
preferred label: architettura islamica @it
preferred label: arquitectura islámica @es
preferred label: Islamic architecture @en
preferred label: islamische Architektur @de
preferred label: Islamitische architectuur @nl
preferred label: عمارة إسلامية @ar
alternative label: architecture musulmane
alternative label: islamische Baukunst @de
related: architecture religieuse
broader: architecture
in scheme: TH 1
member of: pcrtnbDLi2FkAj
member of: pcrtxw5st07tnr
subordinate array: https://pactols.frantiq.fr/opentheso/
created: 2007-02-08 00:00:00.0
modified: 2023-08-02 00:00:00.0
contributor: blandine.nouvel
definition: Art de construire (al-bina) développé dans une région s'étendant de l'Espagne à l'Inde entre 622 et le XIXe siècle, le Dar-al-Islam. (Wikipédia)

architecture mésopotamienne
type: Concept
preferred label: architettura mesopotamica @it
preferred label: arquitectura mesopotámica @es
preferred label: Mesopotamian architecture @en
preferred label: mesopotamische Architektur @de
alternative label: mesopotamische Baukunst @de
related: pcrtg7b3mrkjwg
broader: architecture
in scheme: TH 1
member of: pcrtnbDLi2FkAj
member of: pcrtxw5st07tnr
subordinate array: https://pactols.frantiq.fr/opentheso/
created: 2018-12-04 17:49:01.641753
modified: 2023-08-02 00:00:00.0
creator: magali.lugnot
contributor: blandine.nouvel
definition: Aurenche, 1981 doi : https://doi.org/10.3406/paleo.1981.4297

architecture militaire
type: Concept
preferred label: architettura militare @it
preferred label: arquitectura militar @es
preferred label: militaire architectuur @nl
preferred label: Militärarchitektur @de
preferred label: military architecture @en
preferred label: عمارة عسكرية @ar
broader: architecture
in scheme: TH 1
member of: pcrtnbDLi2FkAj
member of: pcrtxw5st07tnr
subordinate array: https://pactols.frantiq.fr/opentheso/
created: 2007-02-08 00:00:00.0
modified: 2024-03-15 00:00:00.0
contributor: irene.weis
definition: Art, science et technique de la construction, de l'aménagement des édifices en relation avec la guerre. (ER)

architecture minoenne
type: Concept
preferred label: architettura minoica @it
preferred label: arquitectura minoica @es
preferred label: Minoan architecture @en
preferred label: Minoïsche architectuur @nl
preferred label: minoische Baukunst @de
preferred label: عمارة مينوية @ar
alternative label: minoische Architektur @de
broader: architecture
in scheme: TH 1
member of: pcrtnbDLi2FkAj
member of: pcrtxw5st07tnr
subordinate array: https://pactols.frantiq.fr/opentheso/
created: 2007-02-08 00:00:00.0
modified: 2023-08-02 00:00:00.0
contributor: blandine.nouvel
definition: Art de construire pendant la civilisation minoenne qui se développe en Crète de 2700 à 1200 avant J.-C.

architecture monumentale
type: Concept
preferred label: architettura monumentale @it
preferred label: arquitectura monumental @es
preferred label: monumental architecture @en
preferred label: Monumentalarchitektur @de
preferred label: monumentale architectuur @nl
preferred label: عمارة تذكارية @ar
related: pcrtkP8rR1YLpG
related: pcrt3S7lIydczN
related: pcrt4HEc49rMp7
broader: architecture
in scheme: TH 1
member of: pcrtnbDLi2FkAj
member of: pcrtv0jq332vcq3gxt5m13d5
member of: pcrtxw5st07tnr
subordinate array: https://pactols.frantiq.fr/opentheso/
created: 2007-02-08 00:00:00.0
modified: 2023-08-02 00:00:00.0
contributor: blandine.nouvel
scope note: Notion à n'utiliser que pour une vue générale. (BL)
definition: Architecture édifiée pour transmettre à la postérité le souvenir d'une personne ou d'un événement, et qui peut être remarquable par sa taille imposante, son caractère grandiose et imposant, son style.

architecture mycénienne
type: Concept
preferred label: architettura micenea @it
preferred label: arquitectura micénica @es
preferred label: Myceense architectuur @nl
preferred label: Mycenaean architecture @en
preferred label: mykenische Architektur @de
alternative label: mykenische Baukunst @de
related: pcrt3f8dm2kk72
broader: architecture
in scheme: TH 1
member of: pcrtnbDLi2FkAj
member of: pcrtxw5st07tnr
subordinate array: https://pactols.frantiq.fr/opentheso/
created: 2018-11-21 11:13:02.041391
modified: 2023-08-02 00:00:00.0
creator: mompiredda
contributor: blandine.nouvel
definition: Produit de la civilisation mycénienne, qui s'épanouit en Grèce continentale pendant la période du Helladique récent (1550-1050 avant J.-C.). Elle tire son nom du site de Mycènes, et est présente dans le Péloponnèse, en Grèce centrale et en Thessalie. Elle se caractérisée par l'édification d'ouvrages militaires (remparts, fortifications), de palais-forteresses, et de tombes monumentales. (WP le 21.11.2018)

architecture nabatéenne
type: Concept
preferred label: architettura nabatea @it
preferred label: arquitectura nabatea @es
preferred label: Nabataean architecture @en
preferred label: nabatäische Architektur @de
alternative label: nabatäische Baukunst @de
broader: architecture
in scheme: TH 1
member of: pcrtnbDLi2FkAj
member of: pcrtxw5st07tnr
subordinate array: https://pactols.frantiq.fr/opentheso/
created: 2019-12-12 12:30:18.413666
modified: 2023-08-02 00:00:00.0
creator: magali.lugnot
contributor: blandine.nouvel
definition: L'architecture nabatéenne fait référence aux traditions de construction des Nabatéens en Jordanie . Il comprend le temple et les tombes de Petra dans les falaises de grès de la Jordanie du désert du Néguev . Le style semble un mélange de mésopotamienne et hellénistique influences ( en grec). Une grande partie de l'architecture survivante a été creusée dans les falaises rocheuses. Ainsi, les colonnes ne supportent pas vraiment quoi que ce soit. Céramique et pièces faisaient également partie de la culture. En plus des sites les plus célèbres de Petra, il y a aussi des complexes nabatéens à Obodas (Avdat) et des complexes résidentiels à Mampsis (Kurnub) et un site religieux et de-Tannur. (WP)

architecture navale
type: Concept
preferred label: architettura navale @it
preferred label: arquitectura naval @es
preferred label: naval architecture @en
preferred label: scheepsbouwkunde @nl
preferred label: Schiffstechnik @de
preferred label: Ναυπηγική @el
preferred label: корабельные устройства @ru
preferred label: الهندسة المعمارية البحرية @ar
alternative label: ingénierie navale
alternative label: marine engineering @en
alternative label: naval engineering @en
related: pcrt6htVOpKXb1
related: pcrtUz2SlbfhDj
related: pcrtUoafxJtdvz
broader: architecture
in scheme: TH 1
member of: pcrtnbDLi2FkAj
member of: pcrtxw5st07tnr
subordinate array: https://pactols.frantiq.fr/opentheso/
created: 2017-08-01 11:39:45.815686
modified: 2023-08-02 00:00:00.0
creator: evelyne.sinigaglia
contributor: blandine.nouvel
definition: engineering discipline dealing with the design and construction of marine vessels (wikidata) @en
definition: Discipline de l’ingénierie s’intéressant à la construction de navires. Art de concevoir des structures navigantes maritimes et fluviales, pouvant se déplacer sur l'eau et sous l'eau, dont principalement tous les types de bateaux et navires. (Wikipédia). Si dans l'Antiquité et à l'époque médiévale il n'y a pas à proprement parler de conception de navires, cela change à partir du XVIIIe siècle (Duhamel du Monceau, Éléments de l'architecture navale).

architecture paléochrétienne
type: Concept
preferred label: architettura paleocristiana @it
preferred label: arquitectura paleocristiana @es
preferred label: Early Christian architecture @en
preferred label: Frühchristliche Baukunst @de
preferred label: vroegchristelijke architectur @nl
preferred label: عمارة المسيحية المبكرة @ar
alternative label: Paleochristian architecture @en
broader: architecture chrétienne
in scheme: TH 1
member of: pcrtnbDLi2FkAj
member of: pcrtxw5st07tnr
created: 2007-02-08 00:00:00.0
modified: 2023-08-02 00:00:00.0
contributor: blandine.nouvel
definition: Désigne la plus ancienne période de l'architecture chrétienne, qui s'est développée dans l'Empire romain dans l'Antiquité tardive. (WP)

architecture publique
type: Concept
preferred label: architettura pubblica @it
preferred label: arquitectura pública @es
preferred label: burgerlijke architectuur @nl
preferred label: civil architecture @en
preferred label: Profanarchitektur @de
preferred label: عمارة عمومية @ar
alternative label: architecture civile
alternative label: architettura civile @it
alternative label: arquitectura civil @es
broader: architecture
in scheme: TH 1
member of: pcrtnbDLi2FkAj
member of: pcrtxw5st07tnr
subordinate array: https://pactols.frantiq.fr/opentheso/
created: 2007-02-08 00:00:00.0
modified: 2023-08-02 00:00:00.0
contributor: blandine.nouvel
definition: Art, science et technique de la construction, de l'aménagement des édifices liés à l’ensemble des activités et occupations d’un Etat. (ER)

architecture punique
type: Concept
preferred label: architettura punica @it
preferred label: arquitectura púnica @es
preferred label: Punic architecture @en
preferred label: Punische architectuur @nl
preferred label: punische Baukunst @de
preferred label: عمارة قرطاجية @ar
alternative label: Carthaginian architecture @en
alternative label: punische Architektur @de
broader: architecture
in scheme: TH 1
member of: pcrtnbDLi2FkAj
member of: pcrtxw5st07tnr
subordinate array: https://pactols.frantiq.fr/opentheso/
created: 2007-02-08 00:00:00.0
modified: 2023-08-02 00:00:00.0
contributor: blandine.nouvel
definition: art de construire les bâtiments pour les colonies phéniciennes d'Afrique et principalement à Carthage et aux Carthaginois.

architecture religieuse
type: Concept
preferred label: architettura religiosa @it
preferred label: arquitectura religiosa @es
preferred label: religieuze architectuur @nl
preferred label: religious architecture @en
preferred label: Sakralarchitektur @de
preferred label: عمارة دينية @ar
alternative label: church architecture @en
alternative label: ecclesiastical architecture @en
alternative label: sacral architecture @en
alternative label: sacred architecture @en
related: architecture chrétienne
related: architecture islamique
related: pcrtiSegPnzgXc
related: pcrtF9P4mbuyGk
related: pcrt30jRVudWjq
related: pcrt5Zf9Mr7Ils
related: pcrt756q5qdbpb05nrxmmm7q
broader: architecture
in scheme: TH 1
member of: pcrtnbDLi2FkAj
member of: pcrtxw5st07tnr
subordinate array: https://pactols.frantiq.fr/opentheso/
created: 2007-02-08 00:00:00.0
modified: 2024-03-14 00:00:00.0
contributor: irene.weis
definition: Pratique architecturale religieuse qui concerne la conception et la construction de lieux de culte ou d'espaces sacrés ou intentionnels, tels que des églises, des mosquées, des stupas, des synagogues et des temples. (WP)

architecture romaine
type: Concept
preferred label: architettura romana @it
preferred label: arquitectura romana @es
preferred label: Roman architecture @en
preferred label: Romanik @de
preferred label: Romeinse architectuur @nl
preferred label: عمارة رومانية @ar
alternative label: romanische Architektur @de
related: pcrt1ScsoRMkDF
related: pcrtV1LWM7OVzv
related: pcrtgJ5HHSonnQ
broader: architecture
in scheme: TH 1
member of: pcrtnbDLi2FkAj
member of: pcrtxw5st07tnr
subordinate array: https://pactols.frantiq.fr/opentheso/
created: 2007-02-08 00:00:00.0
modified: 2023-08-02 00:00:00.0
contributor: blandine.nouvel
definition: L'architecture romaine devait avant tout servir à mettre en valeur la puissance romaine (sous la République) ainsi que l'idéologie impériale, la personne et les vertus de l'empereur et ses dépenses en faveur de ses concitoyens (sous l'Empire). (Wikipédia)

architecture romane
type: Concept
preferred label: architettura romanica @it
preferred label: arquitectura romana @es
preferred label: romaanse architectuur @nl
preferred label: Romanesque architecture @en
preferred label: romanische Baukunst @de
preferred label: عمارة رمانية @ar
alternative label: romanische Architektur @de
broader: architecture chrétienne
in scheme: TH 1
member of: pcrtnbDLi2FkAj
member of: pcrtxw5st07tnr
created: 2007-02-08 00:00:00.0
modified: 2023-08-02 00:00:00.0
contributor: blandine.nouvel
definition: premier grand style créé au Moyen Âge en Europe après le déclin de la civilisation gréco-romaine. (WP)

architecture rurale
type: Concept
preferred label: architettura rurale @it
preferred label: arquitectura rural @es
preferred label: ländliche Architektur @de
preferred label: rural architecture @en
alternative label: agricultural construction @en
alternative label: construction agricole
alternative label: Hofgebäude @de
related: pcrtIdEjFMFAod
related: pcrt8N9y3ZL4Lh
related: pcrtEcJGnqWUal
related: pcrtLEIWWX4Z3O
related: pcrtVnWeKqGpcj
broader: architecture
in scheme: TH 1
member of: pcrtnbDLi2FkAj
member of: pcrtxw5st07tnr
subordinate array: https://pactols.frantiq.fr/opentheso/
created: 2018-10-30 14:43:26.78764
modified: 2023-08-02 00:00:00.0
creator: marie.lakermance
contributor: blandine.nouvel
note: Une construction agricole est anciennement une bâtisse construite à la campagne, et que l'on a appelée rustique, lorsque les matériaux employés étaient dits rustiques ou grossiers, ou rurale, le synonyme de campagne. (WP)

architecture urbaine
type: Concept
preferred label: architettura urbana @it
preferred label: arquitectura urbana @es
preferred label: Stadtarchitektur @de
preferred label: urban architecture @en
alternative label: urbane Architektur @de
related: pcrtn3BBd5J1Kd
related: pcrthT7f96LxBR
related: pcrtN5zGcqx0YR
related: crtU1ToLkg7Rr
broader: architecture
in scheme: TH 1
member of: pcrtnbDLi2FkAj
member of: pcrtxw5st07tnr
subordinate array: https://pactols.frantiq.fr/opentheso/
created: 2019-09-30 15:51:37.122247
modified: 2023-08-02 00:00:00.0
creator: magali.lugnot
contributor: blandine.nouvel
definition: Pratique architecturale appliquée dans les villes.

architecture vernaculaire
type: Concept
preferred label: architettura vernacolare @it
preferred label: arquitectura vernácula @es
preferred label: vernaculaire architectuur @nl
preferred label: vernacular architecture @en
preferred label: vernakuläre Architektur @de
alternative label: architettura spontanea @it
alternative label: arquitectura popular @es
alternative label: einheimische Architektur @de
alternative label: lokale Architektur @de
alternative label: traditionele architectuur @nl
alternative label: traditionelle Architektur @de
alternative label: volksarchitectuur @nl
related: architecture domestique
related: pcrtVnWeKqGpcj
broader: architecture
in scheme: TH 1
member of: pcrtxw5st07tnr
created: 2023-04-26 00:00:00.0
modified: 2025-08-21 00:00:00.0
creator: remi.ancel
contributor: sophie.kielwasser
definition: Popularly inspired architecture that develops its own characteristics in a specific region where it often uses local materials, traditional ways of doing things and traditional forms. (F. Varin, L'architecture vernaculaire : une définition difficile à cerner, https://www.icomos.org/public/publications/vernacular2.pdf). @en
definition: Eine volkstümlich inspirierte Architektur, die ihre eigenen Merkmale in einer bestimmten Region entwickelt, in der sie oft lokale Materialien, traditionelle Arbeitsweisen und Formen verwendet. (F. Varin, L'architecture vernaculaire: une définition difficile à cerner, https://www.icomos.org/public/publications/vernacular2.pdf). @de
history note: 2025-08-21 : ajout de traductions en allemand, espagnol, italien et néerlandais. Ajout de variantes de libellés. Traduction de la définition en allemand et en anglais.
definition: Architecture d'inspiration populaire qui développe ses caractéristiques propres dans une région spécifique où souvent elle utilise les matériaux locaux, des façons de faire et des formes traditionnelles. (F. Varin, L'architecture vernaculaire : une définition difficile à cerner, https://www.icomos.org/public/publications/vernacular2.pdf).

architecture wisigothique
type: Concept
preferred label: architettura visigota @it
preferred label: arquitectura visigoda @es
preferred label: Visigothic architecture @en
preferred label: Visigothische architectuur @nl
preferred label: westgotische Architektur @de
preferred label: عمارة قوطية @ar
alternative label: arquitectura visigótica @es
alternative label: westgotische Baukunst @de
broader: architecture
in scheme: TH 1
member of: pcrtnbDLi2FkAj
member of: pcrtxw5st07tnr
subordinate array: https://pactols.frantiq.fr/opentheso/
created: 2007-02-08 00:00:00.0
modified: 2023-08-02 00:00:00.0
contributor: blandine.nouvel
definition: D'inspiration romano-byzantine, l'architecture wisigothe donne des édifices massifs, trapus avec des murs épais en pierres de taille ouvragées, le plus souvent à caractère religieux. (Wikipédia)

construction de terre
type: Concept
preferred label: architettura in terra @it
preferred label: arquitectura de tierra @es
preferred label: leemarchitectuur @nl
preferred label: Lehmarchitektur @de
preferred label: mud architecture @en
preferred label: عمارة طينية @ar
alternative label: architecture de terre
alternative label: construcción de tierra @es
alternative label: construction en terre
alternative label: costruzione in terra @it
related: pcrtQuZiT5nYY2
related: pcrtm6uoPROlPN
related: pcrtDpSNLz1mSr
broader: pcrtivcWJilvHp
in scheme: TH 1
member of: pcrttp2qp0084z
member of: pcrtnbDLi2FkAj
subordinate array: https://pactols.frantiq.fr/opentheso/
created: 2007-02-08 00:00:00.0
modified: 2023-08-02 00:00:00.0
contributor: blandine.nouvel
scope note: Notion à n'utiliser que pour une vue générale sur ce thème (BL)
definition: Bâtiment érigé avec de la terre.

technique de construction
type: Concept
preferred label: Bautechnik @de
preferred label: bouwtechniek @nl
preferred label: building technique @en
preferred label: técnica de construcción @es
preferred label: tecnica di costruzione @it
preferred label: تقنيات بناء @ar
alternative label: architectural engineering @en
alternative label: architectural technique @en
alternative label: building engineering @en
alternative label: ciencias de la construcción @es
alternative label: construction technique
alternative label: ingeniería de la construcción @es
alternative label: scienza delle costruzioni @it
alternative label: techniques de construction
alternative label: tecnica delle costruzioni @it
alternative label: técnicas de construcción @es
alternative label: tecniche di costruzione @it
related: pcrt5shIGV5kX3
related: crtLvy980fR9a
related: crtgDyH21iS5G
related: pcrtL3WSQJjK9w
related: pcrtAOIuwSlK60
narrower: pcrtKAnya8qfkN
narrower: pcrtOlL4vtJxgr
narrower: pcrtgBkTk0dR1X
narrower: pcrtAlUSkjY1tj
narrower: pcrtWeehA5itZ7
narrower: pcrtBx4xajlIjR
narrower: pcrtXOuO8FKGbe
narrower: crtKG2rV9hmU5
narrower: remaniement architectural
narrower: pcrt7G67xbK5BN
narrower: pcrtXPJGzbvaRQ
narrower: pcrtlSeyeznPAe
broader: pcrtdUvEkSeyqH
in scheme: TH 1
member of: pcrtj1zjzzpbmd
member of: pcrtnbDLi2FkAj
created: 2007-02-08 00:00:00.0
modified: 2023-08-02 00:00:00.0
contributor: blandine.nouvel
definition: Ensemble de procédés et de moyens pratiques propres à une activité relative à la construction de bâtiments (Lar.)

architecture (conception)
type: Concept
preferred label: architectuur (ontwerp) @nl
preferred label: Architektur (Konzeption) @de
preferred label: architettura (concezione) @it
preferred label: arquitectura (diseño) @es
preferred label: (عمارة (مفهوم @ar
alternative label: architecture (approach) @en
alternative label: architecture conception
alternative label: architecture (design) @en
alternative label: réflexion architecturale
broader: pcrtmvnhq9hpgb
in scheme: TH 1
member of: pcrtrjtm2djdmq3dzpqk0nbz
created: 2007-02-08 00:00:00.0
modified: 2023-08-02 00:00:00.0
contributor: blandine.nouvel
deprecated: true
is replaced by: architecture

construction polyxyle
type: Concept
preferred label: construcción polixila @es
preferred label: costruzione assemblata @it
preferred label: polyxyle Konstruktion @de
preferred label: polyxylous construction @en
preferred label: تجميع قطع منحوتة لصنع قارب @ar
alternative label: architecture assemblée
alternative label: construcción ensamblada @es
alternative label: construction assemblée
alternative label: construction monoxyle assemblée
broader: pcrt6htVOpKXb1
in scheme: TH 1
member of: pcrtnbDLi2FkAj
member of: pcrtxw5st07tnr
created: 2013-11-06 00:00:00.0
modified: 2023-08-02 00:00:00.0
contributor: blandine.nouvel
definition: Construction utilisant des pièce de bois sculptées (et non des planches) et assemblées

Befestigung
type: Concept
preferred label: fortificación @es
preferred label: fortification
preferred label: fortificazione @it
preferred label: versterking @nl
preferred label: تحصينات @ar
alternative label: architecture défensive
hidden label: système défensif
related: pcrt321qD4sfeM
related: pcrtVsTxxPP4OE
related: pcrtroIpDW7j36
related: pcrtNHs49sqYDW
related: pcrtQ9YJIfA1mQ
related: pcrtMbdukIPoQx
related: pcrtp3ks9p736b1b5kjsr3mv
related: pcrt6j9PdPG70O
narrower: pcrt3FTqaIdbpb
narrower: pcrtMmh3cNfKb3
narrower: pcrtKMaTkYqTSh
narrower: pcrt2b6xj08s65p91xx6dx9v
narrower: pcrt461tfjbnc8tq996h5fc7
narrower: pcrt37v88mg3xz3qscdvqkzw
broader: pcrtg7PIE0dTdJ
in scheme: TH 1
member of: pcrttp2qp0084z
member of: pcrtnbDLi2FkAj
member of: pcrtv0jq332vcq3gxt5m13d5
subordinate array: https://pactols.frantiq.fr/opentheso/
created: 2007-02-08 00:00:00.0
modified: 2024-04-17 00:00:00.0
contributor: irene.weis
definition: Ouvrage défensif. (Lar.)

construction monoxyle
type: Concept
preferred label: construcción monóxila @es
preferred label: costruzione monossilo @it
preferred label: monoxyle Konstruktion @de
preferred label: monoxylous construction @en
preferred label: نحت قارب في قطعة خشب واحدة @ar
alternative label: architecture monoxyle
alternative label: monoxilo @it
broader: pcrt6htVOpKXb1
in scheme: TH 1
member of: pcrtnbDLi2FkAj
member of: pcrtxw5st07tnr
created: 2013-11-06 00:00:00.0
modified: 2023-08-02 00:00:00.0
contributor: blandine.nouvel
definition: Construction utilisant une unique pièce de bois taillée dans un tronc d'arbre.

palais
type: Concept
preferred label: palace @en
preferred label: palacio @es
preferred label: Palast @de
preferred label: palazzo @it
preferred label: paleis @nl
preferred label: قصر @ar
alternative label: architecture palatiale
alternative label: arquitectura palaciega @es
alternative label: complesso palaziale @it
alternative label: conjunto palaciego @es
alternative label: palacio real @es
alternative label: palais royal
alternative label: palazzo reale @it
alternative label: reggia @it
related: pcrtDjwWhZNlTq
related: pcrtMHgTyEK2o1
related: crtWO3Jmx5Ozd
narrower: pcrtc7XrUExsTa
narrower: pcrt3f8dm2kk72
broader: pcrtT7xkUlGGbB
in scheme: TH 1
member of: pcrttp2qp0084z
member of: pcrtnbDLi2FkAj
member of: pcrtv0jq332vcq3gxt5m13d5
created: 2007-02-08 00:00:00.0
modified: 2024-03-15 00:00:00.0
contributor: irene.weis
definition: Demeure vaste, siège de l’autorité et du pouvoir, et qui sert de résidence à un personnage important (ATLIF). Anaktoron en grec ancien.

[architecture par style]
type: Concept
preferred label: architecturale stijl @nl
preferred label: Architekturstil @de
preferred label: estilo de arquitectura @es
preferred label: stile d'architettura @it
preferred label: style of architecture @en
preferred label: طراز معماري @ar
alternative label: architecture style
alternative label: style d'architecture
broader: pcrtmvnhq9hpgb
in scheme: TH 1
member of: pcrtrjtm2djdmq3dzpqk0nbz
created: 2007-02-08 00:00:00.0
modified: 2023-08-02 00:00:00.0
contributor: justine.vincent
scope note: Terme de regroupement : ne pas utiliser.
editorial note: 30/09/2019 : anciennement "style d'architecture" en descripteur. 9/12/2021 : déprécié et remplacé dans l'arbre par une facette dépendante de architecture, laquelle reprend l’intitulé initial.
deprecated: true

style pompéien 2
type: Concept
preferred label: 2. Stil @de
preferred label: secondo stile pompeiano @it
preferred label: second Pompeian style @en
preferred label: segundo estilo pompeyano @es
alternative label: Architekturstil @de
alternative label: deuxième style pompéien
alternative label: estilo arquitectónico @es
alternative label: Illusionsstil @de
alternative label: Pompeian Style @en
alternative label: second style pompéien
alternative label: stile architettonico @it
broader: pcrt2mQS548fBA
in scheme: TH 1
member of: pcrttp2qp0084z
member of: pcrtnbDLi2FkAj
created: 2020-02-13 14:54:16.374822
modified: 2025-05-23 00:00:00.0
creator: magali.lugnot
contributor: lubin.grivault
definition: Décor mural développé à partir de 80 av. J.-C., caractérisé par une imitation illusionniste d'architectures en trompe-l'œil, où l'usage de la perspective et de colonnades crée une profondeur fictive.
definition: Wall decoration developed from 80 BC onwards, characterised by an illusionist imitation of trompe-l'œil architecture, where the use of perspective and colonnades creates fictitious depth. @en
history note: 2025-05-23 : Ajout d'une ressource externe, modification et traduction de la définition.

archives privées
type: Concept
preferred label: archivio privato @it
preferred label: archivo privado @es
preferred label: Privatarchiv @de
preferred label: private archive @en
preferred label: privéarchief @nl
preferred label: سجل خاص @ar
alternative label: archives familiales
alternative label: personal archive @en
broader: archieven
in scheme: TH 1
member of: pcrtj1zjzzpbmd
member of: pcrtnbDLi2FkAj
created: 2007-02-08 00:00:00.0
modified: 2025-06-10 00:00:00.0
contributor: lubin.grivault
definition: A set of documents produced or received by natural or legal persons under private law. @en
history note: 2025-06-10 : Ajout et traduction de la définition.
definition: Ensemble de documents produits ou reçus par des personnes physiques ou morales de droit privé.

archives municipales
type: Concept
preferred label: archivio municipale @it
preferred label: archivo municipal @es
preferred label: municipal archive @en
preferred label: stadsarchief @nl
preferred label: Stadtarchiv @de
preferred label: سجل بلدية @ar
alternative label: archivio comunale @it
broader: pcrt5t2drGln1y
in scheme: TH 1
member of: pcrts5kq8x52nf
member of: pcrtnbDLi2FkAj
created: 2007-02-08 00:00:00.0
modified: 2023-08-02 00:00:00.0
contributor: blandine.nouvel

archiviste
type: Concept
preferred label: archivero @es
preferred label: archivist @en
preferred label: Archivist @de
preferred label: archivista @it
related: archieven
broader: pcrtIWZ9OUGKZV
in scheme: TH 1
member of: pcrtxnpdz6h34n
member of: pcrtnbDLi2FkAj
subordinate array: https://pactols.frantiq.fr/opentheso/
created: 2019-11-29 11:43:24.520705
modified: 2025-04-18 00:00:00.0
creator: marie.lakermance
contributor: justine.vincent
definition: Information professional responsible for managing archives. @en
definition: Professionnel de l'information chargé de la gestion des archives.

archives départementales
type: Concept
preferred label: archivio provinciale @it
preferred label: archivo departamental @es
preferred label: departementaal archief @nl
preferred label: departmental archive @en
preferred label: Kreisarchiv @de
preferred label: سجل محافظة @ar
alternative label: archivo provincial @es
alternative label: Departementalarchiv @de
alternative label: Kantonsarchiv @de
broader: pcrt5t2drGln1y
in scheme: TH 1
member of: pcrts5kq8x52nf
member of: pcrtnbDLi2FkAj
created: 2007-02-08 00:00:00.0
modified: 2023-08-02 00:00:00.0
contributor: blandine.nouvel

ouverture
type: Concept
preferred label: abertura @es
preferred label: apertura @it
preferred label: Öffnung @de
preferred label: opening @en
preferred label: فُتحَة @ar
alternative label: baie (architecture)
alternative label: boca @es
related: pcrtiNStQWVtFe
related: pcrt9dfztzdj8vtgk43x9dk5
related: pcrtq4wf13qz12pvzb8j2m6h
narrower: pcrtRKX6aHwyde
narrower: pcrt4otVkR3bqD
narrower: crtP7JUFfkSYS
narrower: pcrtSR6GJ72lOD
narrower: pcrt76mn7782b7tmnvhd2mmn
narrower: pcrtzbksm4m11801nzg5xjfp
narrower: pcrtsg81b599m1d06j0qn6dj
narrower: pcrtdk7kxqj8b80c7dqtbdw6
broader: pcrt4kW0qGXJud
in scheme: TH 1
member of: pcrttp2qp0084z
member of: pcrtnbDLi2FkAj
subordinate array: https://pactols.frantiq.fr/opentheso/
created: 2007-02-08 00:00:00.0
modified: 2025-04-22 00:00:00.0
contributor: blandine.nouvel
definition: Espace vide, orifice par lequel l'intérieur de quelque chose communique avec l'extérieur. (ATLIF) Largeur d'une baie. (ATLIF)

Basile de Césarée
type: Concept
preferred label: Basilio di Cesarea @it
preferred label: Basilius van Caesarea @nl
preferred label: Basilius von Caesarea @de
preferred label: Basil of Caesarea @en
preferred label: San Basilio de Cesarea @es
preferred label: فاسيليوس القيصري @ar
alternative label: Basile de Césarée (saint)
alternative label: Basile le Grand
alternative label: Basilio el Archimandrita @es
alternative label: Basilio el Magno @es
alternative label: Basilio il Grande @it
alternative label: Basilio Magno @it
alternative label: Saint Basile
alternative label: Saint Basil the Great @en
alternative label: San Basilio @it
broader: pcrt1KUldteAgo
in scheme: TH 1
member of: pcrt55mxscwskk
member of: pcrtrG9ejXOVNA
member of: pcrt7sd8c6005bgc5s69qrbt
created: 2007-02-08 00:00:00.0
modified: 2024-03-15 00:00:00.0
contributor: blandine.nouvel
definition: (329-379) père de l'Eglise grecque, évêque de Césarée en Cappadoce à partir de 370

canon des proportions
type: Concept
preferred label: artistic canons of body proportions @en
preferred label: canon de proporciones @es
preferred label: canone delle proporzioni @it
preferred label: Kanon (Kunst) @de
preferred label: proportiecanon @nl
preferred label: مقياس نسب الأبعاد @ar
alternative label: canon architectural
alternative label: canon de beauté
alternative label: canone @it
alternative label: canone di bellezza @it
alternative label: cánones de proporciones @es
alternative label: canon esthétique
alternative label: Proportionslehre @de
related: pcrtdw6uFlaui5
broader: pcrtIvSnh3tF91
in scheme: TH 1
member of: pcrtj1zjzzpbmd
member of: pcrtnbDLi2FkAj
subordinate array: https://pactols.frantiq.fr/opentheso/
created: 2007-02-08 00:00:00.0
modified: 2023-08-02 00:00:00.0
contributor: blandine.nouvel
definition: Un canon dans le domaine des arts visuels, ou canon esthétique, désigne une règle de proportions des dimensions des membres permettant d'obtenir une beauté idéale en sculpture et en peinture. Par extension, on désigne par canon de beauté les caractères considérés comme constituant la beauté à une certaine époque. (WP le 13/02/2020)

chœur (architecture)
type: Concept
preferred label: choir (architecture) @en
preferred label: Chor @de
preferred label: coro (architettura) @it
preferred label: coro (arquitectura) @es
preferred label: koor @nl
preferred label: خورُس @ar
alternative label: chancel @en
hidden label: choeur (architecture)
alternative label: quire @en
related: pcrtfidinSVcTc
related: pcrt706pr08s20rw9nw1pwbq
related: pcrt756q5qdbpb05nrxmmm7q
broader: pcrt4kW0qGXJud
in scheme: TH 1
member of: pcrttp2qp0084z
member of: pcrtnbDLi2FkAj
subordinate array: https://pactols.frantiq.fr/opentheso/
created: 2007-02-08 00:00:00.0
modified: 2023-08-02 00:00:00.0
contributor: blandine.nouvel
definition: Partie de l'église située en tête de la nef où se tient le clergé affecté à cette église, en particulier le clergé chantant l'office canonique. (ATLIF)

style classique gréco-romain
type: Concept
preferred label: estilo clásico grecorromano @es
preferred label: Greco-Roman style @en
preferred label: klassischer griechisch-römischer Stil @de
preferred label: stile classico greco-romano @it
alternative label: Classical architecture @en
related: crt6QevprmtBK
broader: pcrt48897sn0wx
in scheme: TH 1
member of: pcrttp2qp0084z
member of: pcrtnbDLi2FkAj
created: 2020-02-13 15:18:22.945721
modified: 2025-05-23 00:00:00.0
creator: magali.lugnot
contributor: lubin.grivault
definition: A type of sculpture produced in the 5th century BC in the Mediterranean region, characterised by the search for ideal proportions. @en
history note: 2025-05-23 : Modification et traduction de la définition.
definition: Type de sculpture produit au Ve siècle av. J.-C. dans l'espace méditerranéen, caractérisé par la recherche de proportions idéales.

membrure
type: Concept
preferred label: cuaderna @es
preferred label: frame (nautical) @en
preferred label: ossatura (nautica) @it
preferred label: spanten @nl
preferred label: Spanten @de
preferred label: هيكل السفينة @ar
alternative label: couple (architecture navale)
broader: pcrtZWMaHi1dPb
in scheme: TH 1
member of: pcrttp2qp0084z
member of: pcrtnbDLi2FkAj
member of: pcrtv0jq332vcq3gxt5m13d5
created: 2009-11-11 00:00:00.0
modified: 2024-08-30 00:00:00.0
contributor: blandine.nouvel
history note: 2024-08-30 : ajout de la variante "couple" pour Patriarche ; modification et traduction de la définition.
definition: Ensemble des pièces de constructions, en bois (ou en métal) assemblées ou accouplées, d'un bateau qui forment le "squelette" de la coque.
definition: All the assembled or coupled wooden (or metal) structural parts of a boat that form the 'skeleton' of the hull. @en

église de plan byzantin
type: Concept
preferred label: Byzantine Greek-cross-plan church @en
preferred label: byzantinische Kreuzkuppelkirche @de
preferred label: chiesa bizantina (architettura) @it
preferred label: iglesia bizantina (arquitectura) @es
alternative label: Byzantine style church @en
alternative label: église byzantine (architecture)
broader: pcrtoV7zLJpAfX
in scheme: TH 1
member of: pcrttp2qp0084z
member of: pcrtnbDLi2FkAj
created: 2018-12-20 16:39:57.570797
modified: 2023-08-02 00:00:00.0
creator: marie.lakermance
contributor: blandine.nouvel
note: Plan architectural des églises de rite byzantin, Églises orthodoxes et Églises catholiques de rite byzantin. (WP)

ensemble monumental
type: Concept
preferred label: conjunto monumental @es
preferred label: group of monuments @en
preferred label: insieme monumentale @it
preferred label: Monumentalkomplex @de
alternative label: centre monumental
alternative label: centro monumental @es
alternative label: centro monumentale @it
alternative label: espace architectural
alternative label: monumental center @en
alternative label: monumental centre @en
broader: pcrtg7PIE0dTdJ
in scheme: TH 1
member of: pcrttp2qp0084z
member of: pcrtnbDLi2FkAj
created: 2019-09-19 17:40:53.637426
modified: 2023-08-02 00:00:00.0
creator: magali.lugnot
contributor: blandine.nouvel
definition: Ensemble d’unités bâties, qui a les particularités d'un monument (ouvrage d'architecture ou de sculpture édifié pour transmettre à la postérité le souvenir d'une personne ou d'un événement) et notamment le caractère grandiose et imposant.

Démians d'Archimbaud, Gabrielle
type: Concept
alternative label: Gabrielle Démians d'Archimbaud
related: pcrt6zKjfdlT2D
broader: pcrtEWSun8TpKg
in scheme: TH 1
member of: pcrt55mxscwskk
member of: pcrt7sd8c6005bgc5s69qrbt
subordinate array: https://pactols.frantiq.fr/opentheso/
created: 2024-12-10 00:00:00.0
creator: miled.rousset
definition: Archéologue française, 1929-2017, fondatrice de l'archéologie médiévale en France et pionnière de l'étude de la culture matérielle du Moyen Âge (Article "Gabrielle Demians-d'Archimbaud" de Wikipedia en français : https://fr.wikipedia.org/wiki/Gabrielle_D%C3%A9mians_d%27Archimbaud).

terminologie architecturale
type: Concept
alternative label: lexique architectural
alternative label: vocabulaire architectural
broader: pcrtmvnhq9hpgb
in scheme: TH 1
member of: pcrtrjtm2djdmq3dzpqk0nbz
created: 2020-04-17 18:41:54.730848
modified: 2021-03-15 00:00:00.0
creator: magali.lugnot
contributor: magali.lugnot
deprecated: true

De l'architecture (Vitruve)
type: Concept
preferred label: Bücher über die Architektur Vitr @de
preferred label: De Architectura Vitr @nl
preferred label: De architectura (Vitruvio) @es
preferred label: De Architectura (Vitruvius) @en
preferred label: عن العمارة فيتروفيو @ar
alternative label: On architecture @en
alternative label: Sull'architettura @it
alternative label: Ten Books on Architecture @en
related: pcrtTN8Lt4H8HV
broader: pcrt2Y0UU5oFSy
in scheme: TH 1
member of: pcrt55mxscwskk
member of: pcrtrG9ejXOVNA
member of: pcrtN5h4VAwZcq
created: 2007-02-08 00:00:00.0
modified: 2024-03-15 00:00:00.0
contributor: blandine.nouvel

espace de circulation
type: Concept
preferred label: circulation space @en
preferred label: espacio de circulación @es
preferred label: spazio di circolazione @it
alternative label: passage (architecture)
related: pcrtVeZQVh7enW
narrower: pcrt5p3bwgIHaR
narrower: pcrtf1euItAGSn
narrower: pcrtv3UT59y4b6
narrower: pcrtheTIyQA4MB
narrower: pcrtA03yShas9H
narrower: pcrtMHgTyEK2o1
narrower: pcrtsRdSxSAHjb
narrower: pcrtbFJDzRUZx0
narrower: pcrt9rY1ZcA6mi
narrower: pcrtVUHISri9uE
narrower: pcrt3EJjtWAVjc
narrower: pcrt53w0gn7hmrns7ctgh7r1
narrower: pcrt1db1vdq15pxrw3vfhrw3
narrower: pcrt756q5qdbpb05nrxmmm7q
broader: pcrt4kW0qGXJud
in scheme: TH 1
member of: pcrttp2qp0084z
member of: pcrtnbDLi2FkAj
created: 2020-09-29 10:50:49.346628
modified: 2023-07-25 00:00:00.0
contributor: blandine.nouvel
definition: Zone d'un bâtiment permettant les déplacements intérieurs ou qui fait la liaison entre l'intérieur et l'extérieur.

peinture murale
type: Concept
preferred label: muurschildering @nl
preferred label: pintura mural @es
preferred label: pittura murale @it
preferred label: wall painting @en
preferred label: Wandmalerei @de
preferred label: رسم جداري @ar
hidden label: peinture architecturale
related: pcrtaEVNwbclnn
related: pcrtQ7idH3T8L5
related: pcrtvsFBSmOKN2
related: crtkE81jqVGMB
related: pcrtt7dhfwz1vtxg19zbqn99
broader: pcrtmiBDKimOV6
in scheme: TH 1
member of: pcrttp2qp0084z
member of: pcrtnbDLi2FkAj
created: 2007-02-08 00:00:00.0
modified: 2025-05-13 00:00:00.0
contributor: blandine.nouvel
definition: A monumental painting on an interior or exterior wall, vault or ceiling. @en
history note: 2025-04-29 : Modification et traduction de la définition. 2025-05-13 : ajout de la note d'application.
scope note: Pour les peintures sur paroi rocheuse, utiliser "peinture rupestre".
definition: Peinture monumentale dont le support est un mur intérieur ou extérieur, une voûte ou un plafond.

pièce (architecture)
type: Concept
preferred label: habitación @es
preferred label: kamer @nl
preferred label: room @en
preferred label: stanza @it
preferred label: Zimmer @de
preferred label: غرفة @ar
alternative label: camera @it
alternative label: salle
alternative label: space (architectural) @en
narrower: pcrtW9wgN3Gdgb
narrower: pcrtylFLKbzFds
narrower: pcrtDjwWhZNlTq
narrower: pcrte5So6ti147
narrower: crtoLXUE8YuMQ
narrower: pcrt21NHh41vsK
narrower: pcrtrgMarSjVY7
narrower: pcrtt1mJKDzVF9
narrower: pcrt9c7xx9x9vs
narrower: pcrthk2qftj42wn7t5mwr6jp
broader: pcrt4kW0qGXJud
in scheme: TH 1
member of: pcrttp2qp0084z
member of: pcrtnbDLi2FkAj
subordinate array: https://pactols.frantiq.fr/opentheso/
created: 2019-01-06 18:14:19.037621
modified: 2023-08-02 00:00:00.0
contributor: blandine.nouvel
definition: Espace d’un bâtiment, d’une habitation, individualisé par des murs ou cloisons, équivalent de salle, ce dernier étant employé pour des espaces plus vastes (AERBA).
editorial note: à supprimer ?

socle-piédestal
type: Concept
preferred label: pedestal @en
preferred label: piedistallo @it
preferred label: Sockel @de
preferred label: sokkel @nl
preferred label: قاعدة ـ ركيزة @ar
alternative label: base @es
alternative label: base de statue
alternative label: base di statua @it
alternative label: pedestal base @en
alternative label: piédestal
alternative label: piedestallo @it
alternative label: Postamentsockel @de
alternative label: socle
alternative label: soporte @es
alternative label: statue base @en
alternative label: zoccolo (architettura) @it
related: pcrtbhNbSIzWXG
related: pcrtI1R2oldVZn
broader: élément architectural
in scheme: TH 1
member of: pcrttp2qp0084z
member of: pcrtnbDLi2FkAj
created: 2007-02-08 00:00:00.0
modified: 2025-01-09 00:00:00.0
contributor: blandine.nouvel
definition: Support isolé d'une statue, d'une colonne, d'un élément décoratif (CNRTL)